Reaction Details
TargetReverse transcriptase/RNaseH
LigandBDBM50184087
Substrate/Competitorn/a
Meas. Tech.ChEMBL_364650 (CHEMBL854191)
IC50>50000±n/a nM
Citation Krajewski, KZhang, YParrish, DDeschamps, JRoller, PPPathak, VK New HIV-1 reverse transcriptase inhibitors based on a tricyclic benzothiophene scaffold: synthesis, resolution, and inhibitory activity. Bioorg Med Chem Lett16:3034-8 (2006) 
 
Reverse transcriptase/RNaseH
Name:Reverse transcriptase/RNaseH
Type:PROTEIN
Mol. Mass.:65229.15
Organism:Human immunodeficiency virus 1
Description:ChEMBL_1473730
Residue:566
BDBM50184087
NameBDBM50184087
Synonyms:(2aS,7aS)-2-((R)-2-methoxymethyl-pyrrolidin-1-yl)-2aH-7-thia-cyclobuta[a]indene-1,7a-dicarboxylic acid dimethyl ester | CHEMBL208061
TypeSmall organic molecule
Emp. Form.C20H23NO5S
Mol. Mass.389.465
SMILESCOC[C@H]1CCCN1C1=C(C(=O)OC)[C@]2(Sc3ccccc3[C@@H]12)C(=O)OC