Reaction Details
TargetReverse transcriptase/RNaseH
LigandBDBM50184094
Substrate/Competitorn/a
Meas. Tech.ChEMBL_364650 (CHEMBL854191)
IC50>25000±n/a nM
Citation Krajewski, KZhang, YParrish, DDeschamps, JRoller, PPPathak, VK New HIV-1 reverse transcriptase inhibitors based on a tricyclic benzothiophene scaffold: synthesis, resolution, and inhibitory activity. Bioorg Med Chem Lett16:3034-8 (2006) 
 
Reverse transcriptase/RNaseH
Name:Reverse transcriptase/RNaseH
Type:PROTEIN
Mol. Mass.:65229.15
Organism:Human immunodeficiency virus 1
Description:ChEMBL_1473730
Residue:566
BDBM50184094
NameBDBM50184094
Synonyms:(2aS,7aS)-2-((S)-2-methyl-pyrrolidin-1-yl)-2aH-7-thia-cyclobuta[a]indene-1,7a-dicarboxylic acid dimethyl ester | CHEMBL207997
TypeSmall organic molecule
Emp. Form.C19H21NO4S
Mol. Mass.359.439
SMILESCOC(=O)C1=C([C@@H]2c3ccccc3S[C@]12C(=O)OC)N1CCC[C@@H]1C