Reaction Details
TargetReverse transcriptase/RNaseH
LigandBDBM50184096
Substrate/Competitorn/a
Meas. Tech.ChEMBL_364650 (CHEMBL854191)
IC50 2300±n/a nM
Citation Krajewski, KZhang, YParrish, DDeschamps, JRoller, PPPathak, VK New HIV-1 reverse transcriptase inhibitors based on a tricyclic benzothiophene scaffold: synthesis, resolution, and inhibitory activity. Bioorg Med Chem Lett16:3034-8 (2006) 
 
Reverse transcriptase/RNaseH
Name:Reverse transcriptase/RNaseH
Type:PROTEIN
Mol. Mass.:65229.15
Organism:Human immunodeficiency virus 1
Description:ChEMBL_1473730
Residue:566
BDBM50184096
NameBDBM50184096
Synonyms:(2aR,7aR)-2-((S)-2-Methyl-pyrrolidin-1-yl)-2aH-7-thia-cyclobuta[a]indene-1,7a-dicarboxylic acid dimethyl ester | CHEMBL207575
TypeSmall organic molecule
Emp. Form.C19H21NO4S
Mol. Mass.359.439
SMILESCOC(=O)C1=C([C@H]2c3ccccc3S[C@@]12C(=O)OC)N1CCC[C@@H]1C