Reaction Details
TargetComplement C3
LigandBDBM50370743
Substrate/Competitorn/a
Meas. Tech.ChEMBL_365467 (CHEMBL869093)
IC50 205±n/a nM
Citation Katragadda, MMagotti, PSfyroera, GLambris, JD Hydrophobic effect and hydrogen bonds account for the improved activity of a complement inhibitor, compstatin. J Med Chem49:4616-22 (2006) 
 
Complement C3
Name:Complement C3
Type:Enzyme
Mol. Mass.:187142.34
Organism:Homo sapiens (Human)
Description:P01024
Residue:1663
BDBM50370743
NameBDBM50370743
Synonyms:CHEMBL1791380
TypeSmall organic molecule
Emp. Form.C71H103N21O18S2
Mol. Mass.1602.837
SMILESCC[C@H](C)[C@H](NC(=O)[C@H](CS)NC(=O)[C@@H](NC(=O)[C@H](Cc1cn(C)c2ccccc12)NC(=O)[C@H](CCC(N)=O)NC(=O)[C@H](CC(O)=O)NC(=O)[C@H](Cc1c[nH]c2ccccc12)NC(=O)CNC(=O)[C@H](C)NC(=O)[C@H](Cc1cnc[nH]1)NC(=O)[C@H](CCCN=C(N)N)NC(=O)[C@H](CS)NC(=O)[C@@H](N)[C@@H](C)O)C(C)C)C(=O)OC