Reaction Details
TargetD(4) dopamine receptor
LigandBDBM50189842
Substrate/Competitorn/a
Meas. Tech.ChEMBL_367051 (CHEMBL868084)
EC50 2.6±n/a nM
Citation Enguehard-Gueiffier, CHübner, HEl Hakmaoui, AAllouchi, HGmeiner, PArgiolas, AMelis, MRGueiffier, A 2-[(4-phenylpiperazin-1-yl)methyl]imidazo(di)azines as selective D4-ligands. Induction of penile erection by 2-[4-(2-methoxyphenyl)piperazin-1-ylmethyl]imidazo[1,2-a]pyridine (PIP3EA), a potent and selective D4 partial agonist. J Med Chem49:3938-47 (2006) 
 
D(4) dopamine receptor
Name:D(4) dopamine receptor
Type:Enzyme
Mol. Mass.:48373.19
Organism:Homo sapiens (Human)
Description:P21917
Residue:419
BDBM50189842
NameBDBM50189842
Synonyms:2-[4-(4-chlorophenyl)piperazin-1-yl)methyl]imidazo[1,2-a]pyridine | CHEMBL212370
TypeSmall organic molecule
Emp. Form.C18H19ClN4
Mol. Mass.326.823
SMILESClc1ccc(cc1)N1CCN(Cc2cn3ccccc3n2)CC1