Reaction Details
TargetHeme oxygenase 1
LigandBDBM50183063
Substrate/Competitorn/a
Meas. Tech.ChEMBL_368941 (CHEMBL869059)
IC50 1500±n/a nM
Citation Vlahakis, JZKinobe, RTBowers, RJBrien, JFNakatsu, KSzarek, WA Imidazole-dioxolane compounds as isozyme-selective heme oxygenase inhibitors. J Med Chem49:4437-41 (2006) 
 
Heme oxygenase 1
Name:Heme oxygenase 1
Type:PROTEIN
Mol. Mass.:32822.24
Organism:Homo sapiens (Human)
Description:ChEMBL_368941
Residue:288
BDBM50183063
NameBDBM50183063
Synonyms:(2R,4R)-2-[2-(4-chlorophenyl)ethyl]-2-[(1H-imidazol-1-yl)-methyl]-4-methyl-1,3-dioxolane hydrochloride CHEMBL536056
TypeSmall organic molecule
Emp. Form.C16H19ClN2O2
Mol. Mass.306.787
SMILESC[C@@H]1CO[C@@](CCc2ccc(Cl)cc2)(Cn2ccnc2)O1