Reaction Details
TargetDelta-type opioid receptor
LigandBDBM50190373
Substrate/Competitorn/a
Meas. Tech.ChEMBL_376241 (CHEMBL869294)
Ki 1500±n/a nM
Citation Zhang, QKeenan, SMPeng, YNair, ACYu, SJHowells, RDWelsh, WJ Discovery of novel triazole-based opioid receptor antagonists. J Med Chem49:4044-7 (2006) 
 
Delta-type opioid receptor
Name:Delta-type opioid receptor
Type:G Protein-Coupled Receptor (GPCR)
Mol. Mass.:40382.98
Organism:Homo sapiens (Human)
Description:Competition binding assays were carried out using membrane preparations from transfected HN9.10 cells that constitutively expressed the delta opioid receptor.
Residue:372
BDBM50190373
NameBDBM50190373
Synonyms:1-[3-(4-biphenyl)-(1,2,4-triazol-4-yl) ]-3-phenol | CHEMBL208801
TypeSmall organic molecule
Emp. Form.C20H15N3O
Mol. Mass.313.3526
SMILESOc1cccc(c1)-n1cnnc1-c1ccc(cc1)-c1ccccc1