Reaction Details
TargetDelta-type opioid receptor
LigandBDBM50190364
Substrate/Competitorn/a
Meas. Tech.ChEMBL_376241 (CHEMBL869294)
Ki>10000±n/a nM
Citation Zhang, QKeenan, SMPeng, YNair, ACYu, SJHowells, RDWelsh, WJ Discovery of novel triazole-based opioid receptor antagonists. J Med Chem49:4044-7 (2006) 
 
Delta-type opioid receptor
Name:Delta-type opioid receptor
Type:G Protein-Coupled Receptor (GPCR)
Mol. Mass.:40382.98
Organism:Homo sapiens (Human)
Description:Competition binding assays were carried out using membrane preparations from transfected HN9.10 cells that constitutively expressed the delta opioid receptor.
Residue:372
BDBM50190364
NameBDBM50190364
Synonyms:1-{3-[3-(tert-butyl) phenyl]-(1,2,4-triazol-4-yl) }-3-methoxybenzene | CHEMBL212510
TypeSmall organic molecule
Emp. Form.C19H21N3O
Mol. Mass.307.3895
SMILESCOc1cccc(c1)-n1cnnc1-c1ccc(cc1)C(C)(C)C