Reaction Details
TargetMu-type opioid receptor
LigandBDBM50190367
Substrate/Competitorn/a
Meas. Tech.ChEMBL_376242 (CHEMBL869296)
Ki 850±n/a nM
Citation Zhang, QKeenan, SMPeng, YNair, ACYu, SJHowells, RDWelsh, WJ Discovery of novel triazole-based opioid receptor antagonists. J Med Chem49:4044-7 (2006) 
 
Mu-type opioid receptor
Name:Mu-type opioid receptor
Type:G Protein-Coupled Receptor (GPCR)
Mol. Mass.:44789.51
Organism:Homo sapiens (Human)
Description:P35372
Residue:400
BDBM50190367
NameBDBM50190367
Synonyms:1-{3-[3-(tert-butyl) phenyl]-(1,2,4-triazol-4-yl) }-3-phenol | CHEMBL377340
TypeSmall organic molecule
Emp. Form.C18H19N3O
Mol. Mass.293.363
SMILESCC(C)(C)c1cccc(c1)-c1nncn1-c1cccc(O)c1