Reaction Details
TargetMu-type opioid receptor
LigandBDBM50370751
Substrate/Competitorn/a
Meas. Tech.ChEMBL_376242 (CHEMBL869296)
Ki>10000±n/a nM
Citation Zhang, QKeenan, SMPeng, YNair, ACYu, SJHowells, RDWelsh, WJ Discovery of novel triazole-based opioid receptor antagonists. J Med Chem49:4044-7 (2006) 
 
Mu-type opioid receptor
Name:Mu-type opioid receptor
Type:G Protein-Coupled Receptor (GPCR)
Mol. Mass.:44789.51
Organism:Homo sapiens (Human)
Description:P35372
Residue:400
BDBM50370751
NameBDBM50370751
Synonyms:CHEMBL1162931
TypeSmall organic molecule
Emp. Form.C20H24N4O
Mol. Mass.336.4308
SMILESCN(C)c1nnc(-c2ccc(cc2)C(C)(C)C)n1-c1ccc(O)cc1