Reaction Details
TargetKappa-type opioid receptor
LigandBDBM50190374
Substrate/Competitorn/a
Meas. Tech.ChEMBL_376243 (CHEMBL869298)
Ki>10000±n/a nM
Citation Zhang, QKeenan, SMPeng, YNair, ACYu, SJHowells, RDWelsh, WJ Discovery of novel triazole-based opioid receptor antagonists. J Med Chem49:4044-7 (2006) 
 
Kappa-type opioid receptor
Name:Kappa-type opioid receptor
Type:G Protein-Coupled Receptor (GPCR)
Mol. Mass.:42648.76
Organism:Homo sapiens (Human)
Description:P41145
Residue:380
BDBM50190374
NameBDBM50190374
Synonyms:1-{3-[3-(tert-butyl) phenyl]-5-N,N-dimethylaminomethyl-(1,2,4-triazol-4-yl) }-3-phenol CHEMBL211226
TypeSmall organic molecule
Emp. Form.C21H26N4O
Mol. Mass.350.4573
SMILESCN(C)Cc1nnc(-c2cccc(c2)C(C)(C)C)n1-c1cccc(O)c1