Reaction Details
TargetKappa-type opioid receptor
LigandBDBM50190369
Substrate/Competitorn/a
Meas. Tech.ChEMBL_376243 (CHEMBL869298)
Ki>10000±n/a nM
Citation Zhang, QKeenan, SMPeng, YNair, ACYu, SJHowells, RDWelsh, WJ Discovery of novel triazole-based opioid receptor antagonists. J Med Chem49:4044-7 (2006) 
 
Kappa-type opioid receptor
Name:Kappa-type opioid receptor
Type:G Protein-Coupled Receptor (GPCR)
Mol. Mass.:42648.76
Organism:Homo sapiens (Human)
Description:P41145
Residue:380
BDBM50190369
NameBDBM50190369
Synonyms:1-[3-(4-biphenyl)-5-N,N-dimethylamino-(1,2,4-triazol-4-yl) ]-3-phenol | CHEMBL212368
TypeSmall organic molecule
Emp. Form.C22H20N4O
Mol. Mass.356.4204
SMILESCN(C)c1nnc(-c2ccc(cc2)-c2ccccc2)n1-c1cccc(O)c1