Reaction Details
TargetKappa-type opioid receptor
LigandBDBM50190364
Substrate/Competitorn/a
Meas. Tech.ChEMBL_376243 (CHEMBL869298)
Ki>10000±n/a nM
Citation Zhang, QKeenan, SMPeng, YNair, ACYu, SJHowells, RDWelsh, WJ Discovery of novel triazole-based opioid receptor antagonists. J Med Chem49:4044-7 (2006) 
 
Kappa-type opioid receptor
Name:Kappa-type opioid receptor
Type:G Protein-Coupled Receptor (GPCR)
Mol. Mass.:42648.76
Organism:Homo sapiens (Human)
Description:P41145
Residue:380
BDBM50190364
NameBDBM50190364
Synonyms:1-{3-[3-(tert-butyl) phenyl]-(1,2,4-triazol-4-yl) }-3-methoxybenzene | CHEMBL212510
TypeSmall organic molecule
Emp. Form.C19H21N3O
Mol. Mass.307.3895
SMILESCOc1cccc(c1)-n1cnnc1-c1ccc(cc1)C(C)(C)C