Reaction Details
Target5-hydroxytryptamine receptor 1A
LigandBDBM50191637
Substrate/Competitorn/a
Meas. Tech.ChEMBL_376264 (CHEMBL864775)
Ki 1.68±n/a nM
Citation Hatzenbuhler, NTEvrard, DAHarrison, BLHuryn, DInghrim, JKraml, CMattes, JFMewshaw, REZhou, DHornby, GLin, QSmith, DLSullivan, KMSchechter, LEBeyer, CEAndree, TH Synthesis and biological evaluation of novel compounds within a class of 3-aminochroman derivatives with dual 5-HT1A receptor and serotonin transporter affinity. J Med Chem49:4785-9 (2006) 
 
5-hydroxytryptamine receptor 1A
Name:5-hydroxytryptamine receptor 1A
Type:n/a
Mol. Mass.:46122.49
Organism:Homo sapiens (Human)
Description:n/a
Residue:422
BDBM50191637
NameBDBM50191637
Synonyms:CHEMBL211480 | rac-N-(cyclopropylmethyl)-N-[3-(5-fluoro-1H-indol-3-yl)propyl]-N-(5-methoxy-3,4-dihydro-2H-chromen-3-yl)amine
TypeSmall organic molecule
Emp. Form.C25H29FN2O2
Mol. Mass.408.5084
SMILESCOc1cccc2OCC(Cc12)N(CCCc1c[nH]c2ccc(F)cc12)CC1CC1