Reaction Details
TargetSodium-dependent serotonin transporter
LigandBDBM50191629
Substrate/Competitorn/a
Meas. Tech.ChEMBL_376262 (CHEMBL864773)
Ki 20.4±n/a nM
Citation Hatzenbuhler, NTEvrard, DAHarrison, BLHuryn, DInghrim, JKraml, CMattes, JFMewshaw, REZhou, DHornby, GLin, QSmith, DLSullivan, KMSchechter, LEBeyer, CEAndree, TH Synthesis and biological evaluation of novel compounds within a class of 3-aminochroman derivatives with dual 5-HT1A receptor and serotonin transporter affinity. J Med Chem49:4785-9 (2006) 
 
Sodium-dependent serotonin transporter
Name:Sodium-dependent serotonin transporter
Type:Multi-pass membrane protein
Mol. Mass.:70168.43
Organism:Rattus norvegicus (rat)
Description:P31652
Residue:630
BDBM50191629
NameBDBM50191629
Synonyms:(3R)-8-fluoro-3-{[3-(5-fluoro-1H-indol-3-yl)propyl]amino}chromane-5-carboxamide | CHEMBL380401
TypeSmall organic molecule
Emp. Form.C21H21F2N3O2
Mol. Mass.385.4071
SMILESNC(=O)c1ccc(F)c2OC[C@@H](Cc12)NCCCc1c[nH]c2ccc(F)cc12