Reaction Details
Target5-hydroxytryptamine receptor 1A
LigandBDBM50191635
Substrate/Competitorn/a
Meas. Tech.ChEMBL_376264 (CHEMBL864775)
Ki 4.4±n/a nM
Citation Hatzenbuhler, NTEvrard, DAHarrison, BLHuryn, DInghrim, JKraml, CMattes, JFMewshaw, REZhou, DHornby, GLin, QSmith, DLSullivan, KMSchechter, LEBeyer, CEAndree, TH Synthesis and biological evaluation of novel compounds within a class of 3-aminochroman derivatives with dual 5-HT1A receptor and serotonin transporter affinity. J Med Chem49:4785-9 (2006) 
 
5-hydroxytryptamine receptor 1A
Name:5-hydroxytryptamine receptor 1A
Type:n/a
Mol. Mass.:46122.49
Organism:Homo sapiens (Human)
Description:n/a
Residue:422
BDBM50191635
NameBDBM50191635
Synonyms:CHEMBL209784 | rac-8-fluoro-3-[[4-(5-fluoro-1H-indol-3-yl)butyl](propyl)amino] chromane-5-carboxamide
TypeSmall organic molecule
Emp. Form.C25H29F2N3O2
Mol. Mass.441.5135
SMILESCCCN(CCCCc1c[nH]c2ccc(F)cc12)C1COc2c(F)ccc(C(N)=O)c2C1