Reaction Details
TargetSodium-dependent serotonin transporter
LigandBDBM50191636
Substrate/Competitorn/a
Meas. Tech.ChEMBL_376262 (CHEMBL864773)
Ki 13±n/a nM
Citation Hatzenbuhler, NTEvrard, DAHarrison, BLHuryn, DInghrim, JKraml, CMattes, JFMewshaw, REZhou, DHornby, GLin, QSmith, DLSullivan, KMSchechter, LEBeyer, CEAndree, TH Synthesis and biological evaluation of novel compounds within a class of 3-aminochroman derivatives with dual 5-HT1A receptor and serotonin transporter affinity. J Med Chem49:4785-9 (2006) 
 
Sodium-dependent serotonin transporter
Name:Sodium-dependent serotonin transporter
Type:Multi-pass membrane protein
Mol. Mass.:70168.43
Organism:Rattus norvegicus (rat)
Description:P31652
Residue:630
BDBM50191636
NameBDBM50191636
Synonyms:CHEMBL386288 rac-N-cyclobutyl-N-[3-(5-fluoro-1H-indol-3-yl)propyl]-5-methoxychroman-3-amine
TypeSmall organic molecule
Emp. Form.C25H29FN2O2
Mol. Mass.408.5084
SMILESCOc1cccc2OCC(Cc12)N(CCCc1c[nH]c2ccc(F)cc12)C1CCC1