Reaction Details
Target5-hydroxytryptamine receptor 1A
LigandBDBM50191619
Substrate/Competitorn/a
Meas. Tech.ChEMBL_376264 (CHEMBL864775)
Ki 1.5±n/a nM
Citation Hatzenbuhler, NTEvrard, DAHarrison, BLHuryn, DInghrim, JKraml, CMattes, JFMewshaw, REZhou, DHornby, GLin, QSmith, DLSullivan, KMSchechter, LEBeyer, CEAndree, TH Synthesis and biological evaluation of novel compounds within a class of 3-aminochroman derivatives with dual 5-HT1A receptor and serotonin transporter affinity. J Med Chem49:4785-9 (2006) 
 
5-hydroxytryptamine receptor 1A
Name:5-hydroxytryptamine receptor 1A
Type:n/a
Mol. Mass.:46122.49
Organism:Homo sapiens (Human)
Description:n/a
Residue:422
BDBM50191619
NameBDBM50191619
Synonyms:(3R)-(-)-8-Fluoro-3-{[3-(5-fluoro-1H-indol-3-yl)propyl](propyl)amino}chromane-5-carboxamide CHEMBL427411
TypeSmall organic molecule
Emp. Form.C24H27F2N3O2
Mol. Mass.427.4869
SMILESCCCN(CCCc1c[nH]c2ccc(F)cc12)[C@H]1COc2c(F)ccc(C(N)=O)c2C1