Reaction Details
TargetMu-type opioid receptor
LigandBDBM21015
Substrate/Competitorn/a
Meas. Tech.ChEMBL_378702 (CHEMBL853450)
Ki 1.1±n/a nM
Citation Crooks, PAKottayil, SGAl-Ghananeem, AMByrn, SRButterfield, DA Opiate receptor binding properties of morphine-, dihydromorphine-, and codeine 6-O-sulfate ester congeners. Bioorg Med Chem Lett16:4291-5 (2006) 
 
Mu-type opioid receptor
Name:Mu-type opioid receptor
Type:Enzyme Catalytic Domain
Mol. Mass.:11165.58
Organism:GUINEA PIG
Description:P97266
Residue:98
BDBM21015
NameBDBM21015
Synonyms:(2S)-2-{2-[(2R)-2-[(2S)-2-amino-3-(4-hydroxyphenyl)propanamido]propanamido]-N-methylacetamido}-N-(2-hydroxyethyl)-3-phenylpropanamide CHEMBL38874 DAMGO US11492374, ID 2 [tyrosyl-3,5-3H(N)]-D-Ala2-Mephe4-glyol5-enkephalin
TypeAnalgesics
Emp. Form.C26H35N5O6
Mol. Mass.513.586
SMILESC[C@@H](NC(=O)[C@@H](N)Cc1ccc(O)cc1)C(=O)NCC(=O)N(C)[C@@H](Cc1ccccc1)C(=O)NCCO