Reaction Details
TargetExtracellular calcium-sensing receptor
LigandBDBM50193413
Substrate/Competitorn/a
Meas. Tech.ChEMBL_382280 (CHEMBL866784)
IC50 8000±n/a nM
Citation Kessler, AFaure, HPetrel, CRognan, DCésario, MRuat, MDauban, PDodd, RH N1-Benzoyl-N2-[1-(1-naphthyl)ethyl]-trans-1,2-diaminocyclohexanes: Development of 4-chlorophenylcarboxamide (calhex 231) as a new calcium sensing receptor ligand demonstrating potent calcilytic activity. J Med Chem49:5119-28 (2006) 
 
Extracellular calcium-sensing receptor
Name:Extracellular calcium-sensing receptor
Type:PROTEIN
Mol. Mass.:120858.46
Organism:Rattus norvegicus
Description:ChEMBL_750426
Residue:1079
BDBM50193413
NameBDBM50193413
Synonyms:4-methoxy-N-((1R,2R)-2-(1-(naphthalen-1-yl)ethylamino)cyclohexyl)benzenesulfonamide hydrochloride | CHEMBL559185
TypeSmall organic molecule
Emp. Form.C25H30N2O3S
Mol. Mass.438.582
SMILESCOc1ccc(cc1)S(=O)(=O)N[C@@H]1CCCC[C@H]1NC(C)c1cccc2ccccc12