Reaction Details
Target2-dehydropantoate 2-reductase
LigandBDBM50192448
Substrate/Competitorn/a
Meas. Tech.ChEMBL_382751 (CHEMBL854530)
Kd 6300000±n/a nM
Citation Ciulli, AWilliams, GSmith, AGBlundell, TLAbell, C Probing hot spots at protein-ligand binding sites: a fragment-based approach using biophysical methods. J Med Chem49:4992-5000 (2006) 
 
2-dehydropantoate 2-reductase
Name:2-dehydropantoate 2-reductase
Type:PROTEIN
Mol. Mass.:33866.35
Organism:Escherichia coli (strain K12)
Description:ChEMBL_382751
Residue:303
BDBM50192448
NameBDBM50192448
Synonyms:[(2R,3S,4R,5R)-5-(6-amino-9H-purin-9-yl)-3,4-dihydroxyoxolan-2-yl]methyl ({[(3S,4R)-3,4,5-trihydroxyoxolan-2-yl]methyl phosphonato}oxy)phosphonate
TypeSmall organic molecule
Emp. Form.C15H21N5O14P2
Mol. Mass.557.301
SMILESNc1ncnc2n(cnc12)[C@@H]1O[C@H](COP([O-])(=O)OP([O-])(=O)OCC2OC(O)[C@H](O)[C@@H]2O)[C@@H](O)[C@H]1O