Reaction Details
Target2-dehydropantoate 2-reductase
LigandBDBM50368125
Substrate/Competitorn/a
Meas. Tech.ChEMBL_382751 (CHEMBL854530)
Kd 360000±n/a nM
Citation Ciulli, AWilliams, GSmith, AGBlundell, TLAbell, C Probing hot spots at protein-ligand binding sites: a fragment-based approach using biophysical methods. J Med Chem49:4992-5000 (2006) 
 
2-dehydropantoate 2-reductase
Name:2-dehydropantoate 2-reductase
Type:PROTEIN
Mol. Mass.:33866.35
Organism:Escherichia coli (strain K12)
Description:ChEMBL_382751
Residue:303
BDBM50368125
NameBDBM50368125
Synonyms:ADENOSINE DIPHOSPHATE | ADP
TypeSmall organic molecule
Emp. Form.C10H15N5O10P2
Mol. Mass.427.2011
SMILESNc1ncnc2n(cnc12)[C@@H]1O[C@H](CO[P@@](O)(=O)OP(O)(O)=O)[C@@H](O)[C@H]1O