Reaction Details
TargetMu-type opioid receptor
LigandBDBM50193546
Substrate/Competitorn/a
Meas. Tech.ChEMBL_386433 (CHEMBL854558)
Ki 0.210000±n/a nM
Citation Nieland, NPMoynihan, HACarrington, SBroadbear, JWoods, JHTraynor, JRHusbands, SMLewis, JW Structural determinants of opioid activity in derivatives of 14-aminomorphinones: effect of substitution in the aromatic ring of cinnamoylaminomorphinones and codeinones. J Med Chem49:5333-8 (2006) 
 
Mu-type opioid receptor
Name:Mu-type opioid receptor
Type:G Protein-Coupled Receptor (GPCR)
Mol. Mass.:44789.51
Organism:Homo sapiens (Human)
Description:P35372
Residue:400
BDBM50193546
NameBDBM50193546
Synonyms:14beta-(2'-methylcinnamoylamino)-7,8-dihydromorphinone
TypeSmall organic molecule
Emp. Form.C27H28N2O4
Mol. Mass.444.5222
SMILESCN1CC[C@@]23[C@H]4Oc5c2c(CC1[C@@]3(CCC4=O)NC(=O)\C=C\c1ccccc1C)ccc5O