Reaction Details
TargetMu-type opioid receptor
LigandBDBM50193543
Substrate/Competitorn/a
Meas. Tech.ChEMBL_386434 (CHEMBL854561)
Ki 0.600000±n/a nM
Citation Nieland, NPMoynihan, HACarrington, SBroadbear, JWoods, JHTraynor, JRHusbands, SMLewis, JW Structural determinants of opioid activity in derivatives of 14-aminomorphinones: effect of substitution in the aromatic ring of cinnamoylaminomorphinones and codeinones. J Med Chem49:5333-8 (2006) 
 
Mu-type opioid receptor
Name:Mu-type opioid receptor
Type:Enzyme Catalytic Domain
Mol. Mass.:11165.58
Organism:GUINEA PIG
Description:P97266
Residue:98
BDBM50193543
NameBDBM50193543
Synonyms:N-cyclopropylmethyl-14beta-(2'-chlorocinnamoylamino)-7,8-dihydronorcodeinone
TypeSmall organic molecule
Emp. Form.C30H31ClN2O4
Mol. Mass.519.031
SMILESCOc1ccc2CC3N(CC4CC4)CC[C@@]45[C@@H](Oc1c24)C(=O)CC[C@@]35NC(=O)\C=C\c1ccccc1Cl