Reaction Details
TargetKappa-type opioid receptor
LigandBDBM50193544
Substrate/Competitorn/a
Meas. Tech.ChEMBL_386437 (CHEMBL863625)
Ki 0.570000±n/a nM
Citation Nieland, NPMoynihan, HACarrington, SBroadbear, JWoods, JHTraynor, JRHusbands, SMLewis, JW Structural determinants of opioid activity in derivatives of 14-aminomorphinones: effect of substitution in the aromatic ring of cinnamoylaminomorphinones and codeinones. J Med Chem49:5333-8 (2006) 
 
Kappa-type opioid receptor
Name:Kappa-type opioid receptor
Type:G Protein-Coupled Receptor (GPCR)
Mol. Mass.:42648.76
Organism:Homo sapiens (Human)
Description:P41145
Residue:380
BDBM50193544
NameBDBM50193544
Synonyms:N-[(1R,13R,17S)-10-hydroxy-4-methyl-14-oxo-12-oxa-4-azapentacyclo[9.6.1.0^{1,13}.0^{5,17}.0^{7,18}]octadeca-7(18),8,10-trien-17-yl]-3-(4-methylphenyl)propanamide
TypeSmall organic molecule
Emp. Form.C27H30N2O4
Mol. Mass.446.5381
SMILESCN1CC[C@@]23[C@H]4Oc5c2c(CC1[C@@]3(CCC4=O)NC(=O)CCc1ccc(C)cc1)ccc5O