Reaction Details
TargetKappa-type opioid receptor
LigandBDBM50193540
Substrate/Competitorn/a
Meas. Tech.ChEMBL_386443 (CHEMBL864222)
EC50 84±n/a nM
Citation Nieland, NPMoynihan, HACarrington, SBroadbear, JWoods, JHTraynor, JRHusbands, SMLewis, JW Structural determinants of opioid activity in derivatives of 14-aminomorphinones: effect of substitution in the aromatic ring of cinnamoylaminomorphinones and codeinones. J Med Chem49:5333-8 (2006) 
 
Kappa-type opioid receptor
Name:Kappa-type opioid receptor
Type:G Protein-Coupled Receptor (GPCR)
Mol. Mass.:42648.76
Organism:Homo sapiens (Human)
Description:P41145
Residue:380
BDBM50193540
NameBDBM50193540
Synonyms:14beta-(4'-methylcinnamoylamino)-7,8-dihydrocodeinone
TypeSmall organic molecule
Emp. Form.C28H30N2O4
Mol. Mass.458.5488
SMILESCOc1ccc2CC3N(C)CC[C@@]45[C@@H](Oc1c24)C(=O)CC[C@@]35NC(=O)\C=C\c1ccc(C)cc1