Reaction Details
TargetKappa-type opioid receptor
LigandBDBM50033649
Substrate/Competitorn/a
Meas. Tech.ChEMBL_386437 (CHEMBL863625)
Ki 5.5±n/a nM
Citation Nieland, NPMoynihan, HACarrington, SBroadbear, JWoods, JHTraynor, JRHusbands, SMLewis, JW Structural determinants of opioid activity in derivatives of 14-aminomorphinones: effect of substitution in the aromatic ring of cinnamoylaminomorphinones and codeinones. J Med Chem49:5333-8 (2006) 
 
Kappa-type opioid receptor
Name:Kappa-type opioid receptor
Type:G Protein-Coupled Receptor (GPCR)
Mol. Mass.:42648.76
Organism:Homo sapiens (Human)
Description:P41145
Residue:380
BDBM50033649
NameBDBM50033649
Synonyms:1N-[10-hydroxy-4-methyl-14-oxo-(13R,17S)-12-oxa-4-azapentacyclo[9.6.1.01,13.05,17.07,18]octadeca-7(18),8,10-trien-17-yl]-4-(4-nitrophenyl)-(Z)-2-butenamide | CHEMBL110773
TypeSmall organic molecule
Emp. Form.C26H25N3O6
Mol. Mass.475.4932
SMILESCN1CCC23[C@H]4Oc5c2c(CC1[C@@]3(CCC4=O)NC(=O)\C=C\c1ccc(cc1)[N+]([O-])=O)ccc5O