Reaction Details
TargetDelta-type opioid receptor
LigandBDBM50194244
Substrate/Competitorn/a
Meas. Tech.ChEMBL_392092 (CHEMBL869898)
IC50>10000±n/a nM
Citation Balboni, GOnnis, VCongiu, CZotti, MSasaki, YAmbo, ABryant, SDJinsmaa, YLazarus, LHTrapella, CSalvadori, S Effect of lysine at C-terminus of the Dmt-Tic opioid pharmacophore. J Med Chem49:5610-7 (2006) 
 
Delta-type opioid receptor
Name:Delta-type opioid receptor
Type:Enzyme Catalytic Domain
Mol. Mass.:40577.25
Organism:MOUSE
Description:P32300
Residue:372
BDBM50194244
NameBDBM50194244
Synonyms:CHEMBL212172 | H-Dmt-Tic-NH-(D)-CH[(CH2)4-NH-Z]-Bid
TypeSmall organic molecule
Emp. Form.C41H46N6O5
Mol. Mass.702.8411
SMILESCc1cc(O)cc(C)c1CC(N)C(=O)N1Cc2ccccc2CC1C(=O)N[C@H](CCCCNC(=O)OCc1ccccc1)c1nc2ccccc2[nH]1