Reaction Details
TargetDelta-type opioid receptor
LigandBDBM50194269
Substrate/Competitorn/a
Meas. Tech.ChEMBL_392922 (CHEMBL870416)
Ki 110±n/a nM
Citation Wentland, MPVanAlstine, MKucejko, RLou, RCohen, DJParkhill, ALBidlack, JM Redefining the structure-activity relationships of 2,6-methano-3-benzazocines. 4. Opioid receptor binding properties of 8-[N-(4'-phenyl)-phenethyl)carboxamido] analogues of cyclazocine and ethylketocycalzocine. J Med Chem49:5635-9 (2006) 
 
Delta-type opioid receptor
Name:Delta-type opioid receptor
Type:G Protein-Coupled Receptor (GPCR)
Mol. Mass.:40382.98
Organism:Homo sapiens (Human)
Description:Competition binding assays were carried out using membrane preparations from transfected HN9.10 cells that constitutively expressed the delta opioid receptor.
Residue:372
BDBM50194269
NameBDBM50194269
Synonyms:(+/-)-3-(cyclopropylmethyl)-1,2,3,4,5,6-hexahydro-cis-6,11-dimethyl-N-[1,1'-biphenyl]-4-yl-2,6-methano-3-benzazocine-8-carboxamide | CHEMBL215760
TypeSmall organic molecule
Emp. Form.C31H34N2O
Mol. Mass.450.6145
SMILESC[C@H]1C2Cc3ccc(cc3[C@@]1(C)CCN2CC1CC1)C(=O)Nc1ccc(cc1)-c1ccccc1