Reaction Details
TargetPurine nucleoside phosphorylase
LigandBDBM50195595
Substrate/Competitorn/a
Meas. Tech.ChEMBL_414098 (CHEMBL908314)
Ki 30.6±n/a nM
Citation Semeraro, TLossani, ABotta, MGhiron, CAlvarez, RManetti, FMugnaini, CValensin, SFocher, FCorelli, F Simplified analogues of immucillin-G retain potent human purine nucleoside phosphorylase inhibitory activity. J Med Chem49:6037-45 (2006) 
 
Purine nucleoside phosphorylase
Name:Purine nucleoside phosphorylase
Type:Enzyme
Mol. Mass.:32119.53
Organism:Homo sapiens (Human)
Description:n/a
Residue:289
BDBM50195595
NameBDBM50195595
Synonyms:2-amino-1,5-dihydro-7-[[[N-[2-(hydroxy)ethyl]-N-methyl]amino]methyl]-4H-pyrrolo[3,2-d]pyrimidin-4-one diacetate
TypeSmall organic molecule
Emp. Form.C10H15N5O2
Mol. Mass.237.2584
SMILESCN(CCO)Cc1c[nH]c2c1nc(N)[nH]c2=O