Reaction Details
TargetAmyloid-beta precursor protein
LigandBDBM50100131
Substrate/Competitorn/a
Meas. Tech.ChEMBL_414435 (CHEMBL907197)
Ki 0.16±n/a nM
Citation Ryu, EKChoe, YSLee, KHChoi, YKim, BT Curcumin and dehydrozingerone derivatives: synthesis, radiolabeling, and evaluation for beta-amyloid plaque imaging. J Med Chem49:6111-9 (2006) 
 
Amyloid-beta precursor protein
Name:Amyloid-beta precursor protein
Type:Single-pass type I membrane protein
Mol. Mass.:86890.41
Organism:Homo sapiens (Human)
Description:P05067
Residue:770
BDBM50100131
NameBDBM50100131
Synonyms:5-(Biphenyl-4-ylazo)-bis (2-hydroxy-benzoic acid)(Chrysamine G) CHEMBL300172 chrysamine G
TypeSmall organic molecule
Emp. Form.C26H18N4O6
Mol. Mass.482.4443
SMILESOC(=O)c1cc(ccc1O)N=Nc1ccc(cc1)-c1ccc(cc1)N=Nc1ccc(O)c(c1)C(O)=O