Reaction Details
TargetAmyloid-beta precursor protein
LigandBDBM50195682
Substrate/Competitorn/a
Meas. Tech.ChEMBL_414435 (CHEMBL907197)
Ki 19.97±n/a nM
Citation Ryu, EKChoe, YSLee, KHChoi, YKim, BT Curcumin and dehydrozingerone derivatives: synthesis, radiolabeling, and evaluation for beta-amyloid plaque imaging. J Med Chem49:6111-9 (2006) 
 
Amyloid-beta precursor protein
Name:Amyloid-beta precursor protein
Type:Single-pass type I membrane protein
Mol. Mass.:86890.41
Organism:Homo sapiens (Human)
Description:P05067
Residue:770
BDBM50195682
NameBDBM50195682
Synonyms:4-(4-hydroxy-3-iodo-5-methoxyphenyl)-3-buten-2-one | CHEMBL216553
TypeSmall organic molecule
Emp. Form.C11H11IO3
Mol. Mass.318.1077
SMILESCOc1cc(C=CC(C)=O)cc(I)c1O