Reaction Details
TargetAmyloid-beta precursor protein
LigandBDBM50195683
Substrate/Competitorn/a
Meas. Tech.ChEMBL_414435 (CHEMBL907197)
Ki 9.37±n/a nM
Citation Ryu, EKChoe, YSLee, KHChoi, YKim, BT Curcumin and dehydrozingerone derivatives: synthesis, radiolabeling, and evaluation for beta-amyloid plaque imaging. J Med Chem49:6111-9 (2006) 
 
Amyloid-beta precursor protein
Name:Amyloid-beta precursor protein
Type:Single-pass type I membrane protein
Mol. Mass.:86890.41
Organism:Homo sapiens (Human)
Description:P05067
Residue:770
BDBM50195683
NameBDBM50195683
Synonyms:5-hydroxy-1-(4-hydroxy-3-iodo-5-methoxyphenyl)-7-(4-hydroxy-3-methoxyphenyl)-1,4,6-heptatrien-3-one | CHEMBL215110
TypeSmall organic molecule
Emp. Form.C21H19IO6
Mol. Mass.494.2764
SMILESCOc1cc(C=CC(=O)CC(=O)C=Cc2cc(I)c(O)c(OC)c2)ccc1O