Reaction Details
TargetCannabinoid receptor 2
LigandBDBM50180036
Substrate/Competitorn/a
Meas. Tech.ChEMBL_414849 (CHEMBL855031)
Ki 65±n/a nM
Citation Manera, CBenetti, VCastelli, MPCavallini, TLazzarotti, SPibiri, FSaccomanni, GTuccinardi, TVannacci, AMartinelli, AFerrarini, PL Design, synthesis, and biological evaluation of new 1,8-naphthyridin-4(1H)-on-3-carboxamide and quinolin-4(1H)-on-3-carboxamide derivatives as CB2 selective agonists. J Med Chem49:5947-57 (2006) 
 
Cannabinoid receptor 2
Name:Cannabinoid receptor 2
Type:Enzyme Catalytic Domain
Mol. Mass.:38220.43
Organism:MOUSE
Description:P47936
Residue:347
BDBM50180036
NameBDBM50180036
Synonyms:(6aR,10aR)-3-(1,1-dimethylbutyl)-6a,7,10,10a-tetrahydro-6,6,9-trimethyl-6Hdibenzo[b,d]pyran CHEMBL371214 | JWH-133
TypeSmall organic molecule
Emp. Form.C22H32O
Mol. Mass.312.4889
SMILESCCCC(C)(C)c1ccc2[C@@H]3CC(C)=CC[C@H]3C(C)(C)Oc2c1