Reaction Details
TargetCannabinoid receptor 2
LigandBDBM50195527
Substrate/Competitorn/a
Meas. Tech.ChEMBL_414849 (CHEMBL855031)
Ki 1±n/a nM
Citation Manera, CBenetti, VCastelli, MPCavallini, TLazzarotti, SPibiri, FSaccomanni, GTuccinardi, TVannacci, AMartinelli, AFerrarini, PL Design, synthesis, and biological evaluation of new 1,8-naphthyridin-4(1H)-on-3-carboxamide and quinolin-4(1H)-on-3-carboxamide derivatives as CB2 selective agonists. J Med Chem49:5947-57 (2006) 
 
Cannabinoid receptor 2
Name:Cannabinoid receptor 2
Type:Enzyme Catalytic Domain
Mol. Mass.:38220.43
Organism:MOUSE
Description:P47936
Residue:347
BDBM50195527
NameBDBM50195527
Synonyms:CHEMBL387001 | N-cycloheptyl-1-(p-fluorobenzyl)-7-methyl-1,8-naphthyridin-4(1H)-on-3-carboxamide
TypeSmall organic molecule
Emp. Form.C24H26FN3O2
Mol. Mass.407.4805
SMILESCc1ccc2c(n1)n(Cc1ccc(F)cc1)cc(C(=O)NC1CCCCCC1)c2=O