Reaction Details
TargetDelta-type opioid receptor
LigandBDBM50195665
Substrate/Competitorn/a
Meas. Tech.ChEMBL_416465 (CHEMBL907787)
Ki 1.5±n/a nM
Citation Rennison, DMoynihan, HTraynor, JRLewis, JWHusbands, SM Structural determinants of opioid activity in derivatives of 14-aminomorphinones: effects of changes to the chain linking of the C14-amino group to the aryl ring. J Med Chem49:6104-10 (2006) 
 
Delta-type opioid receptor
Name:Delta-type opioid receptor
Type:G Protein-Coupled Receptor (GPCR)
Mol. Mass.:40382.98
Organism:Homo sapiens (Human)
Description:Competition binding assays were carried out using membrane preparations from transfected HN9.10 cells that constitutively expressed the delta opioid receptor.
Residue:372
BDBM50195665
NameBDBM50195665
Synonyms:CHEMBL448428 | N-cyclopropylmethyl-14beta-[2'-(4''-chlorophenyl)-ethanamido]-7,8-dihydronormorphinone
TypeSmall organic molecule
Emp. Form.C28H29ClN2O4
Mol. Mass.492.994
SMILESOc1ccc2C[C@H]3N(CC4CC4)CC[C@@]45[C@@H](Oc1c24)C(=O)CC[C@@]35NC(=O)Cc1ccc(Cl)cc1