Reaction Details
TargetMu-type opioid receptor
LigandBDBM50195670
Substrate/Competitorn/a
Meas. Tech.ChEMBL_416474 (CHEMBL907187)
IC50 1.2±n/a nM
Citation Rennison, DMoynihan, HTraynor, JRLewis, JWHusbands, SM Structural determinants of opioid activity in derivatives of 14-aminomorphinones: effects of changes to the chain linking of the C14-amino group to the aryl ring. J Med Chem49:6104-10 (2006) 
 
Mu-type opioid receptor
Name:Mu-type opioid receptor
Type:G Protein-Coupled Receptor (GPCR)
Mol. Mass.:44789.51
Organism:Homo sapiens (Human)
Description:P35372
Residue:400
BDBM50195670
NameBDBM50195670
Synonyms:CHEMBL216558 | N-cyclopropylmethyl-14beta-[4'-(4''-chlorophenyl)-2'-butenamino]-7,8-dihydronormorphinone
TypeSmall organic molecule
Emp. Form.C30H33ClN2O3
Mol. Mass.505.048
SMILESOc1ccc2C[C@H]3N(CC4CC4)CC[C@@]45[C@@H](Oc1c24)C(=O)CC[C@@]35NC\C=C\Cc1ccc(Cl)cc1