Reaction Details
TargetKappa-type opioid receptor
LigandBDBM50195662
Substrate/Competitorn/a
Meas. Tech.ChEMBL_416478 (CHEMBL907191)
IC50 387±n/a nM
Citation Rennison, DMoynihan, HTraynor, JRLewis, JWHusbands, SM Structural determinants of opioid activity in derivatives of 14-aminomorphinones: effects of changes to the chain linking of the C14-amino group to the aryl ring. J Med Chem49:6104-10 (2006) 
 
Kappa-type opioid receptor
Name:Kappa-type opioid receptor
Type:G Protein-Coupled Receptor (GPCR)
Mol. Mass.:42648.76
Organism:Homo sapiens (Human)
Description:P41145
Residue:380
BDBM50195662
NameBDBM50195662
Synonyms:CHEMBL384118 | N-cyclopropylmethyl-14beta-[4'-(4''-chlorophenyl)-2'-butenamino]-7,8-dihydronorcodeinone
TypeSmall organic molecule
Emp. Form.C31H35ClN2O3
Mol. Mass.519.074
SMILESCOc1ccc2C[C@H]3N(CC4CC4)CC[C@@]45[C@@H](Oc1c24)C(=O)CC[C@@]35NC\C=C\Cc1ccc(Cl)cc1