Reaction Details
TargetMu-type opioid receptor
LigandBDBM50195664
Substrate/Competitorn/a
Meas. Tech.ChEMBL_416474 (CHEMBL907187)
IC50 96±n/a nM
Citation Rennison, DMoynihan, HTraynor, JRLewis, JWHusbands, SM Structural determinants of opioid activity in derivatives of 14-aminomorphinones: effects of changes to the chain linking of the C14-amino group to the aryl ring. J Med Chem49:6104-10 (2006) 
 
Mu-type opioid receptor
Name:Mu-type opioid receptor
Type:G Protein-Coupled Receptor (GPCR)
Mol. Mass.:44789.51
Organism:Homo sapiens (Human)
Description:P35372
Residue:400
BDBM50195664
NameBDBM50195664
Synonyms:(1S,5R,13R,17S)-4-(cyclopropylmethyl)-17-hydroxy-10-methoxy-12-oxa-4-azapentacyclo[9.6.1.0^{1,13}.0^{5,17}.0^{7,18}]octadeca-7(18),8,10-trien-14-one Methoxynaltrexone,3
TypeSmall organic molecule
Emp. Form.C21H25NO4
Mol. Mass.355.4275
SMILESCOc1ccc2C[C@H]3N(CC4CC4)CC[C@@]45[C@@H](Oc1c24)C(=O)CC[C@@]35O