Reaction Details
TargetKappa-type opioid receptor
LigandBDBM50195655
Substrate/Competitorn/a
Meas. Tech.ChEMBL_416478 (CHEMBL907191)
IC50 17±n/a nM
Citation Rennison, DMoynihan, HTraynor, JRLewis, JWHusbands, SM Structural determinants of opioid activity in derivatives of 14-aminomorphinones: effects of changes to the chain linking of the C14-amino group to the aryl ring. J Med Chem49:6104-10 (2006) 
 
Kappa-type opioid receptor
Name:Kappa-type opioid receptor
Type:G Protein-Coupled Receptor (GPCR)
Mol. Mass.:42648.76
Organism:Homo sapiens (Human)
Description:P41145
Residue:380
BDBM50195655
NameBDBM50195655
Synonyms:CHEMBL383896 | N-cyclopropylmethyl-14beta-[4'(4''-chlorophenyl)-3'-butenamino]-7,8-dihydronormorphinone
TypeSmall organic molecule
Emp. Form.C30H33ClN2O3
Mol. Mass.505.048
SMILESOc1ccc2C[C@H]3N(CC4CC4)CC[C@@]45[C@@H](Oc1c24)C(=O)CC[C@@]35NCC\C=C\c1ccc(Cl)cc1