Reaction Details
TargetMu-type opioid receptor
LigandBDBM50195667
Substrate/Competitorn/a
Meas. Tech.ChEMBL_416463 (CHEMBL907785)
Ki 3.9±n/a nM
Citation Rennison, DMoynihan, HTraynor, JRLewis, JWHusbands, SM Structural determinants of opioid activity in derivatives of 14-aminomorphinones: effects of changes to the chain linking of the C14-amino group to the aryl ring. J Med Chem49:6104-10 (2006) 
 
Mu-type opioid receptor
Name:Mu-type opioid receptor
Type:G Protein-Coupled Receptor (GPCR)
Mol. Mass.:44789.51
Organism:Homo sapiens (Human)
Description:P35372
Residue:400
BDBM50195667
NameBDBM50195667
Synonyms:CHEMBL263482 | N-cyclopropylmethyl-14beta-[4'-(4''-chlorophenyl)-butanamido]-7,8-dihydronorcodeinone
TypeSmall organic molecule
Emp. Form.C31H35ClN2O4
Mol. Mass.535.074
SMILESCOc1ccc2C[C@H]3N(CC4CC4)CC[C@@]45[C@@H](Oc1c24)C(=O)CC[C@@]35NC(=O)CCCc1ccc(Cl)cc1