Reaction Details
TargetKappa-type opioid receptor
LigandBDBM50195659
Substrate/Competitorn/a
Meas. Tech.ChEMBL_416469 (CHEMBL907182)
Ki 6.5±n/a nM
Citation Rennison, DMoynihan, HTraynor, JRLewis, JWHusbands, SM Structural determinants of opioid activity in derivatives of 14-aminomorphinones: effects of changes to the chain linking of the C14-amino group to the aryl ring. J Med Chem49:6104-10 (2006) 
 
Kappa-type opioid receptor
Name:Kappa-type opioid receptor
Type:G Protein-Coupled Receptor (GPCR)
Mol. Mass.:42744.99
Organism:Cavia porcellus (domestic guinea pig)
Description:P41144
Residue:380
BDBM50195659
NameBDBM50195659
Synonyms:CHEMBL217395 | N-cyclopropylmethyl-14beta-[3'-(4'-chlorophenyl)propanamido]-7,8-dihydronorcodeinone
TypeSmall organic molecule
Emp. Form.C30H33ClN2O4
Mol. Mass.521.047
SMILESCOc1ccc2C[C@H]3N(CC4CC4)CC[C@@]45[C@@H](Oc1c24)C(=O)CC[C@@]35NC(=O)CCc1ccc(Cl)cc1