Reaction Details
TargetMu-type opioid receptor
LigandBDBM50195669
Substrate/Competitorn/a
Meas. Tech.ChEMBL_416463 (CHEMBL907785)
Ki 1.2±n/a nM
Citation Rennison, DMoynihan, HTraynor, JRLewis, JWHusbands, SM Structural determinants of opioid activity in derivatives of 14-aminomorphinones: effects of changes to the chain linking of the C14-amino group to the aryl ring. J Med Chem49:6104-10 (2006) 
 
Mu-type opioid receptor
Name:Mu-type opioid receptor
Type:G Protein-Coupled Receptor (GPCR)
Mol. Mass.:44789.51
Organism:Homo sapiens (Human)
Description:P35372
Residue:400
BDBM50195669
NameBDBM50195669
Synonyms:CHEMBL411089 | N-cyclopropylmethyl-14beta-[4'-(4''-chlorophenyl)-3'-butenamino]-7,8-dihydronorcodeinone
TypeSmall organic molecule
Emp. Form.C31H35ClN2O3
Mol. Mass.519.074
SMILESCOc1ccc2C[C@H]3N(CC4CC4)CC[C@@]45[C@@H](Oc1c24)C(=O)CC[C@@]35NCC\C=C\c1ccc(Cl)cc1