Reaction Details
TargetMu-type opioid receptor
LigandBDBM50195657
Substrate/Competitorn/a
Meas. Tech.ChEMBL_416463 (CHEMBL907785)
IC50 1.5±n/a nM
Citation Rennison, DMoynihan, HTraynor, JRLewis, JWHusbands, SM Structural determinants of opioid activity in derivatives of 14-aminomorphinones: effects of changes to the chain linking of the C14-amino group to the aryl ring. J Med Chem49:6104-10 (2006) 
 
Mu-type opioid receptor
Name:Mu-type opioid receptor
Type:G Protein-Coupled Receptor (GPCR)
Mol. Mass.:44789.51
Organism:Homo sapiens (Human)
Description:P35372
Residue:400
BDBM50195657
NameBDBM50195657
Synonyms:CHEMBL215926 | N-cyclopropylmethyl-14beta-[4'-(4''-chlorophenyl)-butanamino]-7,8-dihydronorcodeinone
TypeSmall organic molecule
Emp. Form.C31H37ClN2O3
Mol. Mass.521.09
SMILESCOc1ccc2C[C@H]3N(CC4CC4)CC[C@@]45[C@@H](Oc1c24)C(=O)CC[C@@]35NCCCCc1ccc(Cl)cc1