Reaction Details
TargetKappa-type opioid receptor
LigandBDBM50195663
Substrate/Competitorn/a
Meas. Tech.ChEMBL_416464 (CHEMBL907786)
Ki 1.5±n/a nM
Citation Rennison, DMoynihan, HTraynor, JRLewis, JWHusbands, SM Structural determinants of opioid activity in derivatives of 14-aminomorphinones: effects of changes to the chain linking of the C14-amino group to the aryl ring. J Med Chem49:6104-10 (2006) 
 
Kappa-type opioid receptor
Name:Kappa-type opioid receptor
Type:G Protein-Coupled Receptor (GPCR)
Mol. Mass.:42648.76
Organism:Homo sapiens (Human)
Description:P41145
Residue:380
BDBM50195663
NameBDBM50195663
Synonyms:CHEMBL217658 | N-cyclopropylmethyl-14beta-[2'-(4''-chlorophenyl)-ethanamino]-7,8-dihydronormorphinone
TypeSmall organic molecule
Emp. Form.C28H31ClN2O3
Mol. Mass.479.01
SMILESOc1ccc2C[C@H]3N(CC4CC4)CC[C@@]45[C@@H](Oc1c24)C(=O)CC[C@@]35NCCc1ccc(Cl)cc1