Reaction Details
TargetMu-type opioid receptor
LigandBDBM50195673
Substrate/Competitorn/a
Meas. Tech.ChEMBL_416468 (CHEMBL907181)
Ki 0.040000±n/a nM
Citation Rennison, DMoynihan, HTraynor, JRLewis, JWHusbands, SM Structural determinants of opioid activity in derivatives of 14-aminomorphinones: effects of changes to the chain linking of the C14-amino group to the aryl ring. J Med Chem49:6104-10 (2006) 
 
Mu-type opioid receptor
Name:Mu-type opioid receptor
Type:Enzyme Catalytic Domain
Mol. Mass.:11165.58
Organism:GUINEA PIG
Description:P97266
Residue:98
BDBM50195673
NameBDBM50195673
Synonyms:CHEMBL267027 | N-cyclopropylmethyl-14beta-[3'-(4'-chlorophenyl)propanamido]-7,8-dihydronormorphinone
TypeSmall organic molecule
Emp. Form.C29H31ClN2O4
Mol. Mass.507.02
SMILESOc1ccc2C[C@H]3N(CC4CC4)CC[C@@]45[C@@H](Oc1c24)C(=O)CC[C@@]35NC(=O)CCc1ccc(Cl)cc1