Reaction Details
TargetTransporter
LigandBDBM50196226
Substrate/Competitorn/a
Meas. Tech.ChEMBL_418047 (CHEMBL911775)
Ki 473±n/a nM
Citation Zou, MFCao, JKopajtic, TDesai, RIKatz, JLNewman, AH Structure-activity relationship studies on a novel series of (S)-2beta-substituted 3alpha-[bis(4-fluoro- or 4-chlorophenyl)methoxy]tropane analogues for in vivo investigation. J Med Chem49:6391-9 (2006) 
 
Transporter
Name:Transporter
Type:PROTEIN
Mol. Mass.:66787.87
Organism:Rattus norvegicus
Description:ChEMBL_1463061
Residue:597
BDBM50196226
NameBDBM50196226
Synonyms:CHEMBL214234 | S-(+)-2beta-ethenyl-3alpha-[bis(4-fluorophenyl)methoxy]tropane
TypeSmall organic molecule
Emp. Form.C23H25F2NO
Mol. Mass.369.4475
SMILESCN1C2CCC1[C@@H](C=C)[C@H](C2)OC(c1ccc(F)cc1)c1ccc(F)cc1