Reaction Details
TargetMuscarinic acetylcholine receptor M1
LigandBDBM50196226
Substrate/Competitorn/a
Meas. Tech.ChEMBL_418048 (CHEMBL911776)
Ki 163±n/a nM
Citation Zou, MFCao, JKopajtic, TDesai, RIKatz, JLNewman, AH Structure-activity relationship studies on a novel series of (S)-2beta-substituted 3alpha-[bis(4-fluoro- or 4-chlorophenyl)methoxy]tropane analogues for in vivo investigation. J Med Chem49:6391-9 (2006) 
 
Muscarinic acetylcholine receptor M1
Name:Muscarinic acetylcholine receptor M1
Type:Enzyme Catalytic Domain
Mol. Mass.:51390.46
Organism:RAT
Description:P08482
Residue:460
BDBM50196226
NameBDBM50196226
Synonyms:CHEMBL214234 | S-(+)-2beta-ethenyl-3alpha-[bis(4-fluorophenyl)methoxy]tropane
TypeSmall organic molecule
Emp. Form.C23H25F2NO
Mol. Mass.369.4475
SMILESCN1C2CCC1[C@@H](C=C)[C@H](C2)OC(c1ccc(F)cc1)c1ccc(F)cc1