Reaction Details
TargetMu-type opioid receptor
LigandBDBM50199907
Substrate/Competitorn/a
Meas. Tech.ChEMBL_422416 (CHEMBL909851)
Ki 8.9±n/a nM
Citation Le Bourdonnec, BGoodman, AJGraczyk, TMBelanger, SSeida, PRDeHaven, RNDolle, RE Synthesis and pharmacological evaluation of novel octahydro-1H-pyrido[1,2-a]pyrazine as mu-opioid receptor antagonists. J Med Chem49:7290-306 (2006) 
 
Mu-type opioid receptor
Name:Mu-type opioid receptor
Type:G Protein-Coupled Receptor (GPCR)
Mol. Mass.:44789.51
Organism:Homo sapiens (Human)
Description:P35372
Residue:400
BDBM50199907
NameBDBM50199907
Synonyms:3-((3S,7R,8R,9alphaR)-3-benzyl-7,8-dimethyl-octahydro-1H-pyrido[1,2-R]pyrazin-8-yl)phenol US8580788, 70
TypeSmall organic molecule
Emp. Form.C23H30N2O
Mol. Mass.350.4971
SMILESC[C@H]1CN2C[C@H](Cc3ccccc3)NC[C@H]2C[C@@]1(C)c1cccc(O)c1