Reaction Details
TargetMu-type opioid receptor
LigandBDBM50199911
Substrate/Competitorn/a
Meas. Tech.ChEMBL_422416 (CHEMBL909851)
Ki 17±n/a nM
Citation Le Bourdonnec, BGoodman, AJGraczyk, TMBelanger, SSeida, PRDeHaven, RNDolle, RE Synthesis and pharmacological evaluation of novel octahydro-1H-pyrido[1,2-a]pyrazine as mu-opioid receptor antagonists. J Med Chem49:7290-306 (2006) 
 
Mu-type opioid receptor
Name:Mu-type opioid receptor
Type:G Protein-Coupled Receptor (GPCR)
Mol. Mass.:44789.51
Organism:Homo sapiens (Human)
Description:P35372
Residue:400
BDBM50199911
NameBDBM50199911
Synonyms:3-((3S,7R,8R,9alphaR)-2-benzyl-7,8-dimethyl-3-phenyl-octahydro-1H-pyrido[1,2-R]pyrazin-8-yl)benzamide | CHEMBL373925
TypeSmall organic molecule
Emp. Form.C30H35N3O
Mol. Mass.453.6184
SMILESC[C@H]1CN2C[C@@H](N(Cc3ccccc3)C[C@H]2C[C@@]1(C)c1cccc(c1)C(N)=O)c1ccccc1